collection
preferred label: مجموعة @ar
preferred label: kolleksiya @az
preferred label: col·lecció @ca
preferred label: samling @da
preferred label: Sammlung @de
preferred label: colección @es
preferred label: kokoelma @fi
preferred label: gyűjtemény @hu
preferred label: collezione @it
preferred label: コレクション @ja
preferred label: 컬렉션 @ko
preferred label: collectie @nl
preferred label: coleção @pt
preferred label: colecție @ro
preferred label: коллекция @ru
preferred label: kolekcija @sl
preferred label: zbirka @sr
preferred label: збирка @sr-cyrl
preferred label: koleksiyon @tr
preferred label: колекція @uk
preferred label: 收藏品 @zh
preferred label: συλλογή @gr

court documents
type: Concept
in scheme: scheme
preferred label: وثائق قضائية @ar
preferred label: hüquqi sənədlər @az
preferred label: expedient judicial @ca
preferred label: retsdokumenter @da
preferred label: Prozessakte @de
preferred label: expediente judicial @es
preferred label: oikeudenkäyntiasiakirjat @fi
preferred label: document judiciaire @fr
preferred label: expediente xudicial @gl
preferred label: bírósági dokumentumok @hu
preferred label: atti giudiziari @it
preferred label: 裁判所文書 @ja
preferred label: 법원문서 @ko
preferred label: gerechtelijke documenten @nl
preferred label: processos judiciais @pt
preferred label: documente judiciare @ro
preferred label: sodni dokumenti @sl
preferred label: rättsliga dokument @sv
preferred label: adli belgeler @tr
preferred label: судові матеріали @uk
preferred label: 法庭文件 @zh
preferred label: δικαστικά έγγραφα @gr
alternative label: documents judicials @ca
alternative label: retsprotokoller @da
alternative label: Gerichtsdokumente @de
alternative label: Gerichtsakte @de
alternative label: document des tribunaux @fr
alternative label: documentation judiciaire @fr
alternative label: matériel juridique @fr
alternative label: documenti giudiziari @it
alternative label: documentos judiciais @pt
alternative label: acte judiciare @ro
alternative label: sodni spisi @sl
alternative label: dokumenti sodišč @sl
broader: collection
change note:
  comment: initial version
  created: 2024-09-30T11:33:44+00:00
  creator: Isabel Bernal
definition: A set of judicial proceedings that record, physically or digitally, and in an orderly fashion, the development of a process or procedural actions so that they may be recorded and examined by the parties. This would include the set of judicial proceedings and any item within that set as a physical or electronic court document. Adapted from https://dpej.rae.es/lema/expediente-judicial with input from https://www.supremecourt.gov/case_documents.aspx
editorial note: New concept included for version 4 or resource types Vocab
change note:
  comment: Translations added for Arabic, Catalan, Danish, German, Spanish, French, Galician, Greek, Hungarian, Italian, Japanese, Korean, Portuguese, Romanian, Slovenian, Swedish, Turkish, Chinese. Broader Matches added.
  creator: Ellen Ramsey
  modified: 2024-11-27T18:56:53+00:00
change note:
  comment: Translation for Ukrainian added.
  creator: Ellen Ramsey
  modified: 2024-11-30T02:54:43+00:00
change note:
  comment: Capitalization corrected for Italian.
  creator: Ellen Ramsey
  modified: 2024-12-02T18:02:50+00:00
change note:
  comment: Added translations into Dutch and Finnish
  creator: Isabel Bernal
  modified: 2025-04-30T08:04:02+00:00
change note:
  comment: Added Azerbaijani
  creator: Tamy Nakano
  modified: 2025-07-16T21:17:03+00:00
broad match: d4e3790
broad match: D016418